Reaction Details
TargetMonocarboxylate transporter 1
LigandBDBM50092073
Substrate/Competitorn/a
Meas. Tech.Inhibition Assay
pH7.43±n/a
Temperature310.15±n/a K
IC50 9.5±n/a nM
Commentsextracted
Citation Mereddy, VRDrewes, LRAlam, MAJonnalagadda, SKGurrapu, S Therapeutic compounds US Patent US9296728 Publication Date 3/29/2016
 
Monocarboxylate transporter 1
Name:Monocarboxylate transporter 1
Type:Enzyme
Mol. Mass.:53245.17
Organism:Rattus norvegicus (Rat)
Description:P53987
Residue:494
BDBM50092073
NameBDBM50092073
Synonyms:CHEMBL3582418 | US9296728, 13
TypeSmall organic molecule
Emp. Form.C17H22N2O3
Mol. Mass.302.3682
SMILESCCCN(CCC)c1ccc(\C=C(/C#N)C(O)=O)c(OC)c1