Reaction Details
TargetSolute carrier organic anion transporter family member
LigandBDBM50022787
Substrate/Competitorn/a
Meas. Tech.Oatp1d1 Transport Assay
Ki 3.72e+5±n/a nM
Citation Popovic, MZaja, RFent, KSmital, T Molecular characterization of zebrafish Oatp1d1 (Slco1d1), a novel organic anion-transporting polypeptide. J Biol Chem288:33894-911 (2013) 
 
Solute carrier organic anion transporter family member
Name:Solute carrier organic anion transporter family member
Synonyms:Organic anion-transporting polypeptide 1D1 (Oatp1d1)
Type:Protein
Mol. Mass.:75011.81
Organism:Danio rerio (Zebrafish)
Description:A0A8M9PU70
Residue:689
BDBM50022787
NameBDBM50022787
TypeSmall organic molecule
Emp. Form.C16H18N2O4S
Mol. Mass.334.39
SMILESCC1(C)S[C@@H]2[C@H](NC(=O)Cc3ccccc3)C(=O)N2[C@H]1C(O)=O