Reaction Details
TargetHistone deacetylase 7
LigandBDBM32188
Substrate/Competitorn/a
Meas. Tech.HDAC Cell-Free Assays
pH8±n/a
IC50 9.04e+4±n/a nM
Commentsextracted
Citation Cao, BLi, JZhu, JShen, MHan, KZhang, ZYu, YWang, YWu, DChen, SSun, ATang, XZhao, YQiao, CHou, TMao, X The antiparasitic clioquinol induces apoptosis in leukemia and myeloma cells by inhibiting histone deacetylase activity. J Biol Chem288:34181-9 (2013) 
 
Histone deacetylase 7
Name:Histone deacetylase 7
Type:Chromatin regulator; hydrolase; repressor
Mol. Mass.:102942.62
Organism:Homo sapiens (Human)
Description:Q8WUI4
Residue:952
BDBM32188
NameBDBM32188
Synonyms:CLIOQUINOL TG2-36-2 | cid_2788
TypeSmall organic molecule
Emp. Form.C9H5ClINO
Mol. Mass.305.5
SMILESOc1c(I)cc(Cl)c2cccnc12