Reaction Details
TargetPolyamine deacetylase HDAC10
LigandBDBM50005711
Substrate/Competitorn/a
Meas. Tech.HDAC Cell-Free Assays
pH8±n/a
IC50 14.0±0.0 nM
Commentsextracted
Citation Cao, BLi, JZhu, JShen, MHan, KZhang, ZYu, YWang, YWu, DChen, SSun, ATang, XZhao, YQiao, CHou, TMao, X The antiparasitic clioquinol induces apoptosis in leukemia and myeloma cells by inhibiting histone deacetylase activity. J Biol Chem288:34181-9 (2013) 
 
Polyamine deacetylase HDAC10
Name:Polyamine deacetylase HDAC10
Type:Chromatin regulator; hydrolase; repressor
Mol. Mass.:71431.89
Organism:Homo sapiens (Human)
Description:Q969S8
Residue:669
BDBM50005711
NameBDBM50005711
Synonyms:CHEBI:46024 TRICHOSTATIN Trichostatin A (TSA) US10722597, Compound Trichostatin US20230322747, Compound trichostatin A | US9265734, TSA
TypeSmall organic molecule
Emp. Form.C17H22N2O3
Mol. Mass.302.3682
SMILESC[C@H](\C=C(/C)\C=C\C(=O)NO)C(=O)c1ccc(cc1)N(C)C