Reaction Details
TargetSulfotransferase 2A1
LigandBDBM50176062
Substrate/Competitorn/a
Meas. Tech.Amoxapine and Protriptyline Inhibition Assay
pH7.5±n/a
Temperature275.15±n/a K
Ki 7.6e+4± 1.15e+4 nM
Commentsextracted
Citation Cook, IWang, TFalany, CNLeyh, TS High accuracy in silico sulfotransferase models. J Biol Chem288:34494-501 (2013) 
 
Sulfotransferase 2A1
Name:Sulfotransferase 2A1
Type:Enzyme
Mol. Mass.:33776.92
Organism:Homo sapiens (Human)
Description:Q06520
Residue:285
BDBM50176062
NameBDBM50176062
Synonyms:3-(5H-dibenzo[a,d][7]annulen-5-yl)-N-methylpropan-1-amine 5-(3-methylaminopropyl)-5H-dibenzo[a,d]cycloheptene CHEMBL668 N-methyl-5H-dibenzo[a,d]cycloheptene-5-propylamine amimetilina
TypeSmall organic molecule
Emp. Form.C19H21N
Mol. Mass.263.3767
SMILESCNCCCC1c2ccccc2C=Cc2ccccc12