Reaction Details
TargetUridine 5'-monophosphate synthase
LigandBDBM214779
Substrate/Competitorn/a
Meas. Tech.Inhibition Assay
pH8±n/a
Temperature298.15±n/a K
Ki 41±19 nM
Commentsextracted
Citation Zhang, YEvans, GBClinch, KCrump, DRHarris, LDFröhlich, RFTyler, PCHazleton, KZCassera, MBSchramm, VL Transition state analogues of Plasmodium falciparum and human orotate phosphoribosyltransferases. J Biol Chem288:34746-54 (2013) 
 
Uridine 5'-monophosphate synthase
Name:Uridine 5'-monophosphate synthase
Type:Enzyme
Mol. Mass.:52224.99
Organism:Homo sapiens (Human)
Description:P11172
Residue:480
BDBM214779
NameBDBM214779
Synonyms:OPRT inhibitor, 2
TypeSmall organic molecule
Emp. Form.C11H14NO10P
Mol. Mass.351.2033
SMILESOC1C(O)[C@H](Oc2ccc(cc2)[N+]([O-])=O)O[C@@H]1COP(O)(O)=O