Reaction Details
TargetUridine 5'-monophosphate synthase
LigandBDBM214784
Substrate/Competitorn/a
Meas. Tech.Inhibition Assay
pH8±n/a
Temperature298.15±n/a K
Ki 110±30 nM
Commentsextracted
Citation Zhang, YEvans, GBClinch, KCrump, DRHarris, LDFröhlich, RFTyler, PCHazleton, KZCassera, MBSchramm, VL Transition state analogues of Plasmodium falciparum and human orotate phosphoribosyltransferases. J Biol Chem288:34746-54 (2013) 
 
Uridine 5'-monophosphate synthase
Name:Uridine 5'-monophosphate synthase
Type:Enzyme
Mol. Mass.:52224.99
Organism:Homo sapiens (Human)
Description:P11172
Residue:480
BDBM214784
NameBDBM214784
Synonyms:OPRT inhibitor, 7
TypeSmall organic molecule
Emp. Form.C11H13N3O6
Mol. Mass.283.2374
SMILESOC[C@@H]1C(O)C(O)[C@@H]2Cn3c(cc(=O)[nH]c3=O)C(=O)N12