Reaction Details
TargetKappa-type opioid receptor [M226A]
LigandBDBM214798
Substrate/Competitorn/a
Meas. Tech.Homologous Competition Assay
pH7.4±n/a
Temperature298.15±n/a K
Ki 7.1±3.8 nM
Commentsextracted
Citation Vardy, EMosier, PDFrankowski, KJWu, HKatritch, VWestkaemper, RBAubé, JStevens, RCRoth, BL Chemotype-selective modes of action of ¿-opioid receptor agonists. J Biol Chem288:34470-83 (2013) 
 
Kappa-type opioid receptor [M226A]
Name:Kappa-type opioid receptor [M226A]
Type:Protein
Mol. Mass.:42588.64
Organism:Homo sapiens (Human)
Description:Human KOR with M226A mutation
Residue:380
BDBM214798
NameBDBM214798
Synonyms:Dynorphin A (1-17) | YGGFLRRIRPKLK
TypeSmall organic molecule
Emp. Form.C75H126N24O15
Mol. Mass.1603.9547
SMILESCC[C@H](C)[C@H](NC(=O)[C@H](CCCNC(N)=N)NC(=O)[C@H](CCCNC(N)=N)NC(=O)[C@H](CC(C)C)NC(=O)[C@H](Cc1ccccc1)NC(=O)CNC(=O)CNC(=O)[C@@H](N)Cc1ccc(O)cc1)C(=O)N[C@@H](CCCNC(N)=N)C(=O)N1CCC[C@H]1C(=O)N[C@@H](CCCCN)C(=O)N[C@@H](CC(C)C)C(=O)N[C@@H](CCCCN)C(O)=O