Reaction Details
TargetKappa-type opioid receptor [Y312A]
LigandBDBM214799
Substrate/Competitorn/a
Meas. Tech.Homologous Competition Assay
pH7.4±n/a
Temperature298.15±n/a K
Ki 3.9e+2±1.7e+2 nM
Commentsextracted
Citation Vardy, EMosier, PDFrankowski, KJWu, HKatritch, VWestkaemper, RBAubé, JStevens, RCRoth, BL Chemotype-selective modes of action of ¿-opioid receptor agonists. J Biol Chem288:34470-83 (2013) 
 
Kappa-type opioid receptor [Y312A]
Name:Kappa-type opioid receptor [Y312A]
Type:Protein
Mol. Mass.:42556.66
Organism:Homo sapiens (Human)
Description:Human KOR with Y312A mutation
Residue:380
BDBM214799
NameBDBM214799
Synonyms:1xx
TypeSmall organic molecule
Emp. Form.C24H22ClF3N2O2
Mol. Mass.462.892
SMILESFC(F)(F)c1cc(NC(=O)[C@H]2CC=C[C@H]3CCN(Cc4ccccc4)C(=O)[C@@H]23)ccc1Cl