Reaction Details
TargetKappa-type opioid receptor [M226A]
LigandBDBM21130
Substrate/Competitorn/a
Meas. Tech.cAMP Inhibition Assay
pH7.4±n/a
EC50 0.19±0.02 nM
Commentsextracted
Citation Vardy, EMosier, PDFrankowski, KJWu, HKatritch, VWestkaemper, RBAubé, JStevens, RCRoth, BL Chemotype-selective modes of action of ¿-opioid receptor agonists. J Biol Chem288:34470-83 (2013) 
 
Kappa-type opioid receptor [M226A]
Name:Kappa-type opioid receptor [M226A]
Type:Protein
Mol. Mass.:42588.64
Organism:Homo sapiens (Human)
Description:Human KOR with M226A mutation
Residue:380
BDBM21130
NameBDBM21130
Synonyms:N-methyl-2-phenyl-N-[(5R,7S,8S)-7-(pyrrolidin-1-yl)-1-oxaspiro[4.5]decan-8-yl]acetamide U-69593 [3H]U69593
Typeradiolabeled ligand
Emp. Form.C22H32N2O2
Mol. Mass.356.5017
SMILESCN([C@H]1CC[C@@]2(CCCO2)C[C@@H]1N1CCCC1)C(=O)Cc1ccccc1