Reaction Details
TargetMuscarinic acetylcholine receptor M3 [1-273,470-589,N6Q,N15Q,N41Q,N48Q,N52Q]
LigandBDBM214800
Substrate/Competitorn/a
Meas. Tech.[3H]NMS/Carbachol Binding Assay
pH7.4±n/a
Kd 0.403±0.128 nM
Commentsextracted
Citation Hu, JHu, KLiu, TStern, MKMistry, RChalliss, RACostanzi, SWess, J Novel structural and functional insights into M3 muscarinic receptor dimer/oligomer formation. J Biol Chem288:34777-90 (2013) 
 
Muscarinic acetylcholine receptor M3 [1-273,470-589,N6Q,N15Q,N41Q,N48Q,N52Q]
Name:Muscarinic acetylcholine receptor M3 [1-273,470-589,N6Q,N15Q,N41Q,N48Q,N52Q]
Type:Protein
Mol. Mass.:46046.63
Organism:Rattus norvegicus (Rat)
Description:Modified rat M3R Δ274-469 lacking N-glycosylation sites (N6Q, N15Q, N41Q, N48Q, N52Q) and contains triple factor Xa site (IEGR)3 within i3 loop
Residue:405
BDBM214800
NameBDBM214800
Synonyms:N-methylscopolamine (NMS)
TypeSmall organic molecule
Emp. Form.C18H24NO4
Mol. Mass.318.3869
SMILESC[N+]1(C)[C@H]2CC(C[C@@H]1[C@H]1O[C@@H]21)OC(=O)[C@H](CO)c1ccccc1