Reaction Details
TargetMuscarinic acetylcholine receptor M3 [1-273,470-589,N6Q,N15Q,N41Q,N48Q,N52Q]
LigandBDBM50004656
Substrate/Competitorn/a
Meas. Tech.[3H]NMS/Carbachol Binding Assay
pH7.4±n/a
Ki 2.46e+4± 7.6e+3 nM
Commentsextracted
Citation Hu, JHu, KLiu, TStern, MKMistry, RChalliss, RACostanzi, SWess, J Novel structural and functional insights into M3 muscarinic receptor dimer/oligomer formation. J Biol Chem288:34777-90 (2013) 
 
Muscarinic acetylcholine receptor M3 [1-273,470-589,N6Q,N15Q,N41Q,N48Q,N52Q]
Name:Muscarinic acetylcholine receptor M3 [1-273,470-589,N6Q,N15Q,N41Q,N48Q,N52Q]
Type:Protein
Mol. Mass.:46046.63
Organism:Rattus norvegicus (Rat)
Description:Modified rat M3R Δ274-469 lacking N-glycosylation sites (N6Q, N15Q, N41Q, N48Q, N52Q) and contains triple factor Xa site (IEGR)3 within i3 loop
Residue:405
BDBM50004656
NameBDBM50004656
Synonyms:(2-Carbamoyloxy-ethyl)-trimethyl-ammonium (2-Hydroxyethyl)trimethyl ammonium chloride carbamate (carbachol)(2-Carbamoyloxy-ethyl)-trimethyl-ammonium 2-((Aminocarbonyl)oxy)-N,N,N-trimethylethanaminum chloride 2-(carbamoyloxy)-N,N,N-trimethylethanaminium chloride CARBASTAT Carbachol chloride Choline carbamate chloride Choline chlorine carbamate Karbamoylcholin chlorid | MIOSTAT
TypeSmall organic molecule
Emp. Form.C6H15N2O2
Mol. Mass.147.195
SMILESC[N+](C)(C)CCOC(N)=O