Reaction Details
TargetMuscarinic acetylcholine receptor M3 [1-273,470-589,N6Q,N15Q,N41Q,N48Q,N52Q,T552C]
LigandBDBM50004656
Substrate/Competitorn/a
Meas. Tech.[3H]NMS/Carbachol Binding Assay
pH7.4±n/a
Ki 1.46e+4± 2.3e+3 nM
Commentsextracted
Citation Hu, JHu, KLiu, TStern, MKMistry, RChalliss, RACostanzi, SWess, J Novel structural and functional insights into M3 muscarinic receptor dimer/oligomer formation. J Biol Chem288:34777-90 (2013) 
 
Muscarinic acetylcholine receptor M3 [1-273,470-589,N6Q,N15Q,N41Q,N48Q,N52Q,T552C]
Name:Muscarinic acetylcholine receptor M3 [1-273,470-589,N6Q,N15Q,N41Q,N48Q,N52Q,T552C]
Type:Protein
Mol. Mass.:46048.67
Organism:Rattus norvegicus (Rat)
Description:Rat M3'(3C)-Xa with T552C mutation
Residue:405
BDBM50004656
NameBDBM50004656
Synonyms:(2-Carbamoyloxy-ethyl)-trimethyl-ammonium (2-Hydroxyethyl)trimethyl ammonium chloride carbamate (carbachol)(2-Carbamoyloxy-ethyl)-trimethyl-ammonium 2-((Aminocarbonyl)oxy)-N,N,N-trimethylethanaminum chloride 2-(carbamoyloxy)-N,N,N-trimethylethanaminium chloride CARBASTAT Carbachol chloride Choline carbamate chloride Choline chlorine carbamate Karbamoylcholin chlorid | MIOSTAT
TypeSmall organic molecule
Emp. Form.C6H15N2O2
Mol. Mass.147.195
SMILESC[N+](C)(C)CCOC(N)=O