Reaction Details
TargetCellular tumor antigen p53 [1-83]/E3 ubiquitin-protein ligase Mdm2 [1-188]
LigandBDBM215409
Substrate/Competitorn/a
Meas. Tech.Homogenous Time-Resolved Fluorescence Assay (HTRF2 Assay)
pH7.4±n/a
Temperature298.15±n/a K
IC50 0.2±n/a nM
Commentsextracted
Citation Bartberger, MDGonzalez Buenrostro, ABeck, HPChen, XConnors, RVDeignan, JDuquette, JAEksterowicz, JFisher, BFox, BMFu, JFu, ZGonzalez Lopez De Turiso, FGribble, MWGustin, DJHeath, JAHuang, XJiao, XJohnson, MGKayser, FKopecky, DJLai, SLi, YLi, ZLiu, JLow, JDLucas, BSMa, ZMcGee, LRMcIntosh, JMcMinn, DLMedina, JCMihalic, JTOlson, SHRew, YRoveto, PMSun, DWang, XWang, YYan, XYu, MZhu, J Piperidinone derivatives as MDM2 inhibitors for the treatment of cancer US Patent US9296736 Publication Date 3/29/2016
 
Cellular tumor antigen p53 [1-83]/E3 ubiquitin-protein ligase Mdm2 [1-188]
Name:Cellular tumor antigen p53 [1-83]/E3 ubiquitin-protein ligase Mdm2 [1-188]
Type:Enzyme
Mol. Mass.:n/a
Description:n/a
Components:This complex has 2 components.
Component 1
Name:E3 ubiquitin-protein ligase Mdm2 [1-188]
Synonyms:E3 ubiquitin-protein ligase Mdm2 (aa 1-188) MDM2_HUMAN
Type:n/a
Mol. Mass.:21319.18
Organism:Homo sapiens (Human)
Description:Q00987[1-188]
Residue:188
Component 2
Name:Cellular tumor antigen p53 [1-83]
Synonyms:P53 TP53 | Tumor suppressor p53
Type:Enzyme
Mol. Mass.:8975.74
Organism:Homo sapiens (Human)
Description:Residues 1-83
Residue:83
BDBM215409
NameBDBM215409
Synonyms:US9296736, 397 | US9593129, Example 397
TypeSmall organic molecule
Emp. Form.C27H30Cl2FNO5S
Mol. Mass.570.5
SMILESCC[C@@H](CS(=O)(=O)C1CC1)N1[C@@H]([C@H](C[C@](C)(CC(O)=O)C1=O)c1cc(F)cc(Cl)c1)c1ccc(Cl)cc1