Reaction Details
TargetTyrosine-protein kinase ITK/TSK
LigandBDBM290235
Substrate/Competitorn/a
Meas. Tech.Enzymatic Activity Assay
pH7.5±n/a
IC50 3.50±n/a nM
Commentsextracted
Citation Brameld, KAOwens, T Benzimidazole derivatives as ITK inhibitors US Patent US9573958 Publication Date 2/21/2017
 
Tyrosine-protein kinase ITK/TSK
Name:Tyrosine-protein kinase ITK/TSK
Type:Protein
Mol. Mass.:71839.20
Organism:Homo sapiens (Human)
Description:Q08881
Residue:620
BDBM290235
NameBDBM290235
Synonyms:US9573958, Compound 62
TypeSmall organic molecule
Emp. Form.C32H38F2N6O2S
Mol. Mass.608.745
SMILESC[C@H](NCc1ccc2n(C[C@H]3CCCN3C(=O)C(=CC3CC3)C#N)c(NC(=O)c3ccc(s3)C(F)F)nc2c1)C(C)(C)C