Reaction Details
TargetDiacylglycerol O-acyltransferase 2
LigandBDBM215451
Substrate/Competitorn/a
Meas. Tech.In Vitro DGAT2 Assay
pH7.4±n/a
Temperature298.15±n/a K
IC50 11.5±n/a nM
Commentsextracted
Citation Ahn, KBoehm, MCabral, SCarpino, PAFutatsugi, KHepworth, DKung, DWOrr, SWang, J Diacylglycerol acyltransferase 2 inhibitors US Patent US9296745 Publication Date 3/29/2016
 
Diacylglycerol O-acyltransferase 2
Name:Diacylglycerol O-acyltransferase 2
Type:Multi-pass membrane protein
Mol. Mass.:43848.90
Organism:Homo sapiens (Human)
Description:Q96PD7
Residue:388
BDBM215451
NameBDBM215451
Synonyms:US9296745, 6
TypeSmall organic molecule
Emp. Form.C25H26N6O2
Mol. Mass.442.5129
SMILESO=C([C@@H]1CCCN(C1)c1ccc2nc([nH]c2n1)-c1cccc(c1)-c1cnco1)N1CCCC1