Reaction Details
TargetDiacylglycerol O-acyltransferase 2
LigandBDBM215538
Substrate/Competitorn/a
Meas. Tech.DGAT2 Cell-Based Assay
IC50 15.9±n/a nM
Citation Ahn, KBoehm, MCabral, SCarpino, PAFutatsugi, KHepworth, DKung, DWOrr, SWang, J Diacylglycerol acyltransferase 2 inhibitors US Patent US9296745 Publication Date 3/29/2016
 
Diacylglycerol O-acyltransferase 2
Name:Diacylglycerol O-acyltransferase 2
Type:Multi-pass membrane protein
Mol. Mass.:43848.90
Organism:Homo sapiens (Human)
Description:Q96PD7
Residue:388
BDBM215538
NameBDBM215538
Synonyms:US9296745, 95
TypeSmall organic molecule
Emp. Form.C23H27N7O
Mol. Mass.417.5068
SMILESO=C([C@@H]1CCCN(C1)c1ccc2nc([nH]c2n1)-c1ccnc(n1)C1CC1)N1CCCC1