Reaction Details
TargetNischarin
LigandBDBM215802
Substrate/Competitorn/a
Meas. Tech.I1 Receptor Binding Assay
pH7.35±n/a
Temperature310.15±n/a K
Ki 0.22±n/a nM
Commentsextracted
Citation Bousquet, PEhrhardt, JDFellmann, LGasparik, VGreney, HHadjeri, MMann, ANiederhoffer, NSchann, S Amino-pyrroline derivatives, and use thereof in the prevention and/or treatment of metabolic syndrome US Patent US9303019 Publication Date 4/5/2016
 
Nischarin
Name:Nischarin
Type:Enzyme
Mol. Mass.:166571.31
Organism:Homo sapiens (Human)
Description:Q9Y2I1
Residue:1504
BDBM215802
NameBDBM215802
Synonyms:US9303019, 8
TypeSmall organic molecule
Emp. Form.C14H17ClN2
Mol. Mass.248.751
SMILESCC1CN=C(C1)Nc1ccc(Cl)c2CCCc12