Reaction Details
TargetRho-associated protein kinase 2
LigandBDBM217321
Substrate/Competitorn/a
Meas. Tech.ROCK2 Kinase Activity Assays
Ki 5.26±n/a nM
Citation Curtin, MLSorensen, BKHeyman, HRClark, RFWoller, KRShah, OJMichaelides, MTse, CVasudevan, AMack, HHansen, TMSweis, RPliushchev, MA NAMPT and rock inhibitors US Patent US9302989 Publication Date 4/5/2016
 
Rho-associated protein kinase 2
Name:Rho-associated protein kinase 2
Type:Protein
Mol. Mass.:160885.43
Organism:Homo sapiens (Human)
Description:O75116
Residue:1388
BDBM217321
NameBDBM217321
Synonyms:US9302989, 376
TypeSmall organic molecule
Emp. Form.C24H19N3O2
Mol. Mass.381.4266
SMILESO=C(Nc1ccc(cc1)-c1c[nH]c(=O)c2ccccc12)N1Cc2ccccc2C1