Reaction Details
TargetRho-associated protein kinase 2
LigandBDBM217088
Substrate/Competitorn/a
Meas. Tech.ROCK2 Kinase Activity Assays
Ki 3.61±n/a nM
Citation Curtin, MLSorensen, BKHeyman, HRClark, RFWoller, KRShah, OJMichaelides, MTse, CVasudevan, AMack, HHansen, TMSweis, RPliushchev, MA NAMPT and rock inhibitors US Patent US9302989 Publication Date 4/5/2016
 
Rho-associated protein kinase 2
Name:Rho-associated protein kinase 2
Type:Protein
Mol. Mass.:160885.43
Organism:Homo sapiens (Human)
Description:O75116
Residue:1388
BDBM217088
NameBDBM217088
Synonyms:US9302989, 383
TypeSmall organic molecule
Emp. Form.C29H30N6O2
Mol. Mass.494.5875
SMILESCN1CCN(Cc2ccc3CN(Cc3c2)C(=O)Nc2ccc(cc2)-c2n[nH]c(=O)c3ccccc23)CC1