Reaction Details
TargetRho-associated protein kinase 2
LigandBDBM217092
Substrate/Competitorn/a
Meas. Tech.ROCK2 Kinase Activity Assays
Ki 1.39±n/a nM
Citation Curtin, MLSorensen, BKHeyman, HRClark, RFWoller, KRShah, OJMichaelides, MTse, CVasudevan, AMack, HHansen, TMSweis, RPliushchev, MA NAMPT and rock inhibitors US Patent US9302989 Publication Date 4/5/2016
 
Rho-associated protein kinase 2
Name:Rho-associated protein kinase 2
Type:Protein
Mol. Mass.:160885.43
Organism:Homo sapiens (Human)
Description:O75116
Residue:1388
BDBM217092
NameBDBM217092
Synonyms:US9302989, 387
TypeSmall organic molecule
Emp. Form.C29H28N4O2
Mol. Mass.464.5582
SMILESO=C(Nc1ccc(cc1)-c1c[nH]c(=O)c2ccccc12)N1Cc2ccc(CN3CCCC3)cc2C1