Reaction Details
TargetThyroid peroxidase
LigandBDBM217356
Substrate/Competitorn/a
Meas. Tech.LPO/TPO Selectivity Assay
IC50 1.59e+3± 1e+1 nM
Citation Forbes, LVSjögren, TAuchère, FJenkins, DWThong, BLaughton, DHemsley, PPairaudeau, GTurner, REriksson, HUnitt, JFKettle, AJ Potent reversible inhibition of myeloperoxidase by aromatic hydroxamates. J Biol Chem288:36636-47 (2013) 
 
Thyroid peroxidase
Name:Thyroid peroxidase
Type:Enzyme
Mol. Mass.:102965.07
Organism:Homo sapiens (Human)
Description:P07202
Residue:933
BDBM217356
NameBDBM217356
Synonyms:2-(benzylamino)-6-oxo-3H-pyrimidine-5-carbohydroxamic acid (HX3)
TypeSmall organic molecule
Emp. Form.C12H12N4O3
Mol. Mass.260.2487
SMILESONC(=O)c1c[nH]c(NCc2ccccc2)nc1=O