Reaction Details
TargetMyeloperoxidase
LigandBDBM217354
Substrate/Competitorn/a
Meas. Tech.Surface Plasmon Resonance (SPR)
pH5±n/a
Kd 15.8± 0.1 nM
Commentsextracted
Citation Forbes, LVSjögren, TAuchère, FJenkins, DWThong, BLaughton, DHemsley, PPairaudeau, GTurner, REriksson, HUnitt, JFKettle, AJ Potent reversible inhibition of myeloperoxidase by aromatic hydroxamates. J Biol Chem288:36636-47 (2013) 
 
Myeloperoxidase
Name:Myeloperoxidase
Type:Enzyme
Mol. Mass.:83888.32
Organism:Homo sapiens (Human)
Description:P05164
Residue:745
BDBM217354
NameBDBM217354
Synonyms:2-(3,5-bistrifluoromethylbenzylamino)-6-oxo-1H-pyrimidine-5-carbohydroxamic acid (HX1)
TypeSmall organic molecule
Emp. Form.C14H10F6N4O3
Mol. Mass.396.2446
SMILESONC(=O)c1cnc(NCc2cc(cc(c2)C(F)(F)F)C(F)(F)F)[nH]c1=O