Reaction Details
TargetPlasminogen [101-181]
LigandBDBM290269
Substrate/Competitorn/a
Meas. Tech.Biacore Assay
pH7±n/a
IC50 14.0±n/a nM
Commentsextracted
Citation Haßfeld, JKinzel, TKöbberling, JCancho-Grande, YBeyer, KRöhrig, SKöllnberger, MSperzel, MBurkhardt, NSchlemmer, KStegmann, CSchuhmacher, JWerner, MEllermann, M (Aza)pyridopyrazolopyrimidinones and indazolopyrimidinones and their use US Patent US10098883 Publication Date 10/16/2018
 
Plasminogen [101-181]
Name:Plasminogen [101-181]
Type:Enzyme Catalytic Domain
Mol. Mass.:9281.08
Organism:Homo sapiens (Human)
Description:P00747[101-181]
Residue:81
BDBM290269
NameBDBM290269
Synonyms:10-Bromo-4-(piperidin-4-yl)pyrimido[1,2-b]indazol-2(1H)-one hydrochloride US10098883, Example 60 | US10668071, Example 60
TypeSmall organic molecule
Emp. Form.C15H15BrN4O
Mol. Mass.347.21
SMILESBrc1cccc2nn3c(cc(=O)[nH]c3c12)C1CCNCC1