Reaction Details
TargetTrans-sialidase [3-643,D247A]
LigandBDBM217358
Substrate/Competitorn/a
Meas. Tech.Diffusion Ordered Spectroscopy (DOSY)
Temperature284.15±n/a K
Kd 1.07e+5± 2e+3 nM
Commentsextracted
Citation Oliveira, IAGonçalves, ASNeves, JLvon Itzstein, MTodeschini, AR Evidence of ternary complex formation in Trypanosoma cruzi trans-sialidase catalysis. J Biol Chem289:423-36 (2014) 
 
Trans-sialidase [3-643,D247A]
Name:Trans-sialidase [3-643,D247A]
Synonyms:trans-Sialidase (TS D247A)
Type:Enzyme
Mol. Mass.:70266.23
Organism:Trypanosoma cruzi
Description:T. cruzi TS D247A mutant
Residue:641
BDBM217358
NameBDBM217358
TypeSmall organic molecule
Emp. Form.C23H39NO19
Mol. Mass.633.5511
SMILESCC(=O)NC1C(O)CC(OC2C(O)C(CO)OC(OC3C(CO)OC(O)C(O)C3O)C2O)(OC1[C@H](O)[C@H](O)CO)C(O)=O