Reaction Details
TargetTrans-sialidase [3-643]
LigandBDBM50048093
Substrate/CompetitorBDBM217357
Meas. Tech.Diffusion Ordered Spectroscopy (DOSY)
Temperature284.15±n/a K
Kd 1.5e+4± 1e+3 nM
Commentsextracted
Citation Oliveira, IAGonçalves, ASNeves, JLvon Itzstein, MTodeschini, AR Evidence of ternary complex formation in Trypanosoma cruzi trans-sialidase catalysis. J Biol Chem289:423-36 (2014) 
 
Trans-sialidase [3-643]
Name:Trans-sialidase [3-643]
Synonyms:trans-Sialidase (TS)
Type:Enzyme
Mol. Mass.:70309.23
Organism:Trypanosoma cruzi
Description:Q9BHJ5 with +2 shift
Residue:641
BDBM50048093
BDBM217357
NameBDBM50048093
TypeSmall organic molecule
Emp. Form.C13H24O11
Mol. Mass.356.3231
SMILESCO[C@@H]1O[C@H](CO)[C@@H](O[C@@H]2O[C@H](CO)[C@H](O)[C@H](O)[C@H]2O)[C@H](O)[C@H]1O