Reaction Details
TargetEstradiol-bound Estrogen receptor [255-595]
LigandBDBM217393
Substrate/Competitorn/a
Meas. Tech.Fluorescence Polarization Assay
pH7.4±n/a
Temperature298.15±n/a K
Kd 7.1e+3± 1.3e+3 nM
Commentsextracted
Citation Tressler, CMZondlo, NJ Perfluoro-tert-butyl Homoserine Is a Helix-Promoting, Highly Fluorinated, NMR-Sensitive Aliphatic Amino Acid: Detection of the Estrogen Receptor·Coactivator Protein-Protein Interaction by (19)F NMR. Biochemistry56:1062-1074 (2017) 
 
Estradiol-bound Estrogen receptor [255-595]
Name:Estradiol-bound Estrogen receptor [255-595]
Synonyms:Estradiol-bound ERα LBD
Type:Protein
Mol. Mass.:n/a
Description:n/a
Components:This complex has 2 components.
Component 1
Name:Estrogen receptor [255-595]
Type:Protein
Mol. Mass.:38412.26
Organism:Homo sapiens (Human)
Description:Human estrogen receptor ligand binding domain (255-595 aa)
Residue:341
Component 2
NameBDBM17292
Synonyms:(1S,10R,11S,14S,15S)-15-methyltetracyclo[8.7.0.0^{2,7}.0^{11,15}]heptadeca-2,4,6-triene-5,14-diol 17α-ethinylestradiol CHEMBL135 ESTRADIOL Ovocyclin US9040509, E2 US9561238, E2 [2,4,6,7-3H]-E2 [3H]]estradiol
TypeSteroid
Emp. Form.C18H24O2
Mol. Mass.272.382
SMILES[H][C@@]12CC[C@H](O)[C@@]1(C)CC[C@]1([H])c3ccc(O)cc3CC[C@@]21[H]
BDBM217393
NameBDBM217393
Synonyms:CLTERHK(Hse(C4F9))LHRLLQE | Ile8Hse(C4F9)
TypeSmall organic molecule
Emp. Form.C84H136F9N27O23S
Mol. Mass.2095.196
SMILESCC(C)C[C@H](NC(=O)[C@@H](N)CS)C(=O)N[C@@H]([C@@H](C)O)C(=O)N[C@@H](CCC(O)=O)C(=O)N[C@@H](CCCNC(N)=N)C(=O)N[C@@H](Cc1cnc[nH]1)C(=O)N[C@@H](CCCCN)C(=O)N[C@@H](CCOC(C(F)(F)F)(C(F)(F)F)C(F)(F)F)C(=O)N[C@@H](CC(C)C)C(=O)N[C@@H](Cc1cnc[nH]1)C(=O)N[C@@H](CCCNC(N)=N)C(=O)N[C@@H](CC(C)C)C(=O)N[C@@H](CC(C)C)C(=O)N[C@@H](CCC(N)=O)C(=O)N[C@@H](CCC(O)=O)C(O)=O