Reaction Details
TargetCytochrome P450 2C8
LigandBDBM155253
Substrate/Competitorn/a
Meas. Tech.Assessment of CYP Inhibition
IC50>100±0.0 nM
Citation Kuntz, KWCampbell, JESeki, M Substituted benzene compounds US Patent US10098888 Publication Date 10/16/2018
 
Cytochrome P450 2C8
Name:Cytochrome P450 2C8
Type:Protein
Mol. Mass.:55839.23
Organism:Homo sapiens (Human)
Description:P10632
Residue:490
BDBM155253
NameBDBM155253
Synonyms:US10098888, Compound 1 | US9006242, 1
TypeSmall organic molecule
Emp. Form.C35H48N4O4
Mol. Mass.588.78
SMILESCCN([C@H]1CC[C@@H](CC1)N(C)C)c1cc(cc(C(=O)NCc2c(C)cc(C)[nH]c2=O)c1C)-c1ccc(OCCOC)cc1