Reaction Details
TargetCytochrome P450 2C19
LigandBDBM155254
Substrate/Competitorn/a
Meas. Tech.Assessment of CYP Inhibition
IC50>100±0.0 nM
Citation Kuntz, KWCampbell, JESeki, M Substituted benzene compounds US Patent US10098888 Publication Date 10/16/2018
 
Cytochrome P450 2C19
Name:Cytochrome P450 2C19
Type:Enzyme
Mol. Mass.:55935.47
Organism:Homo sapiens (Human)
Description:P33261
Residue:490
BDBM155254
NameBDBM155254
Synonyms:US10098888, Compound 2 | US9006242, 2
TypeSmall organic molecule
Emp. Form.C35H51N5O4
Mol. Mass.605.8105
SMILESCCN([C@H]1CC[C@@H](CC1)N(C)CCOC)c1cc(cc(C(=O)NCc2c(C)cc(C)[nH]c2=O)c1C)C#CCN1CCOCC1