Reaction Details
TargetHistone deacetylase 6
LigandBDBM218163
Substrate/Competitorn/a
Meas. Tech.HDAC Activity Assay
pH8±n/a
IC50 5.11±0.08 nM
Commentsextracted
Citation Kozikowski, AKalin, JHButler, KVBergman, JHancock, WW HDAC inhibitors and therapeutic methods using the same US Patent US9249087 Publication Date 2/2/2016
 
Histone deacetylase 6
Name:Histone deacetylase 6
Type:Chromatin regulator; hydrolase; repressor
Mol. Mass.:131381.51
Organism:Homo sapiens (Human)
Description:Q9UBN7
Residue:1215
BDBM218163
NameBDBM218163
Synonyms:US9249087, 6
TypeSmall organic molecule
Emp. Form.C17H16N2O2
Mol. Mass.280.3211
SMILESCc1cn(Cc2ccc(cc2)C(=O)NO)c2ccccc12