Reaction Details
TargetHistone deacetylase 6
LigandBDBM218169
Substrate/Competitorn/a
Meas. Tech.HDAC Activity Assay
pH8±n/a
IC50 3.48±n/a nM
Commentsextracted
Citation Kozikowski, AKalin, JHButler, KVBergman, JHancock, WW HDAC inhibitors and therapeutic methods using the same US Patent US9249087 Publication Date 2/2/2016
 
Histone deacetylase 6
Name:Histone deacetylase 6
Type:Chromatin regulator; hydrolase; repressor
Mol. Mass.:131381.51
Organism:Homo sapiens (Human)
Description:Q9UBN7
Residue:1215
BDBM218169
NameBDBM218169
Synonyms:US9249087, 12
TypeSmall organic molecule
Emp. Form.C13H11N5O2
Mol. Mass.269.2587
SMILESONC(=O)c1ccc(Cn2cnc3cncnc23)cc1