Reaction Details
TargetHistone deacetylase 6
LigandBDBM218187
Substrate/Competitorn/a
Meas. Tech.HDAC Activity Assay
pH8±n/a
IC50 0.17±n/a nM
Commentsextracted
Citation Kozikowski, AKalin, JHButler, KVBergman, JHancock, WW HDAC inhibitors and therapeutic methods using the same US Patent US9249087 Publication Date 2/2/2016
 
Histone deacetylase 6
Name:Histone deacetylase 6
Type:Chromatin regulator; hydrolase; repressor
Mol. Mass.:131381.51
Organism:Homo sapiens (Human)
Description:Q9UBN7
Residue:1215
BDBM218187
NameBDBM218187
Synonyms:US9249087, 30
TypeSmall organic molecule
Emp. Form.C19H21N3O4S
Mol. Mass.387.453
SMILESCS(=O)(=O)NCCc1cn(Cc2ccc(cc2)C(=O)NO)c2ccccc12