Reaction Details
TargetPotassium channel subfamily K member 3
LigandBDBM218534
Substrate/Competitorn/a
Meas. Tech.TASK-1 Inhibiition Assay
Temperature298.15±n/a K
IC50 37±n/a nM
Commentsextracted
Citation Bialy, LLorenz, KWirth, KSteinmeyer, KHessler, G Fused pyrroledicarboxamides and their use as pharmaceuticals US Patent US9284333 Publication Date 3/15/2016
 
Potassium channel subfamily K member 3
Name:Potassium channel subfamily K member 3
Type:Protein
Mol. Mass.:43534.71
Organism:Homo sapiens (Human)
Description:O14649
Residue:394
BDBM218534
NameBDBM218534
Synonyms:US9284333, 16ks | US9884860, Example 16ks
TypeSmall organic molecule
Emp. Form.C22H27N3O2S
Mol. Mass.397.534
SMILESCC[C@@H](NC(=O)c1cc(C(=O)N2CCC[C@@H]2C)n2CCSc12)c1ccccc1