Reaction Details
TargetS-methyl-5'-thioinosine phosphorylase
LigandBDBM218675
Substrate/Competitorn/a
Meas. Tech.Inhibition Assay
pH7.4±n/a
Temperature298.15±n/a K
Ki 0.035±0.003 nM
Commentsextracted
Citation Schramm, VLClinch, KTyler, PCEvans, GBFurneaux, RH Methods, assays and compounds for treating bacterial infections by inhibiting methylthioinosine phosphorylase US Patent US9290501 Publication Date 3/22/2016
 
S-methyl-5'-thioinosine phosphorylase
Name:S-methyl-5'-thioinosine phosphorylase
Type:Enzyme
Mol. Mass.:26266.70
Organism:Pseudomonas aeruginosa
Description:Q9HZK1
Residue:245
BDBM218675
NameBDBM218675
Synonyms:US9290501, PT-ImmH
TypeSmall organic molecule
Emp. Form.C18H20N4O3S
Mol. Mass.372.441
SMILESOC1[C@@H](CSc2ccccc2)NC(Cc2c[nH]c3c2nc[nH]c3=O)C1O