Reaction Details
TargetMetabotropic glutamate receptor 2
LigandBDBM160756
Substrate/Competitorn/a
Meas. Tech.MGluR2 cAMP Assay
pH7±n/a
EC50 5.00±n/a nM
Commentsextracted
Citation Mattson, RJMeng, ZGuernon, LR Positive allosteric modulators of mGluR2 US Patent US9682980 Publication Date 6/20/2017
 
Metabotropic glutamate receptor 2
Name:Metabotropic glutamate receptor 2
Type:Enzyme
Mol. Mass.:95584.88
Organism:Homo sapiens (Human)
Description:Q14416
Residue:872
BDBM160756
NameBDBM160756
Synonyms:US9682980, 8-Chloro-7-(4-(2,4-dimethoxyphenyl)piperidin-1-yl)-3-(2,2,2-trifluoroethyl)-[1,2,4]triazolo[4,3-b]pyridazine
TypeSmall organic molecule
Emp. Form.C20H21ClF3N5O2
Mol. Mass.455.861
SMILESCOc1ccc(C2CCN(CC2)c2cnn3c(CC(F)(F)F)nnc3c2Cl)c(OC)c1