Reaction Details
TargetCoagulation factor XII
LigandBDBM218840
Substrate/Competitorn/a
Meas. Tech.Protease Inhibition Assay
pH7.4±n/a
Ki 25±6 nM
Commentsextracted
Citation van de Langemheen, HKorotkovs, VBijl, JWilson, CKale, SSHeinis, CLiskamp, RM Polar Hinges as Functionalized Conformational Constraints in (Bi)cyclic Peptides. Chembiochem18:387-395 (2017) 
 
Coagulation factor XII
Name:Coagulation factor XII
Type:Enzyme
Mol. Mass.:67810.07
Organism:Homo sapiens (Human)
Description:P00748
Residue:615
BDBM218840
NameBDBM218840
Synonyms:TATA-FXII618 (14)
TypeSmall organic molecule
Emp. Form.C15H27N3O3S3
Mol. Mass.393.588
SMILESCSCCC(=O)N1CN(CN(C1)C(=O)CCSC)C(=O)CCSC