Reaction Details
TargetCasein kinase II subunit beta
LigandBDBM219719
Substrate/CompetitorBDBM220103
Meas. Tech.Inhibition Assay
pH7±n/a
IC50>500±n/a nM
Commentsextracted
Citation Haddach, MTran, JAPierre, FRegan, CFRaffaele, NRavula, SRyckman, DM Pyrazolopyrimidines and related heterocycles as CK2 inhibitors US Patent US9303033 Publication Date 4/5/2016
 
Casein kinase II subunit beta
Name:Casein kinase II subunit beta
Type:Enzyme
Mol. Mass.:24937.13
Organism:Homo sapiens (Human)
Description:P67870
Residue:215
BDBM219719
BDBM220103
NameBDBM219719
Synonyms:US9303033, D35, Table 39A, Compound 26
TypeSmall organic molecule
Emp. Form.C18H14N10O3
Mol. Mass.418.369
SMILESO=C1NC(=O)\C(N1)=C\c1cnn2c(NC3CC3)nc(Oc3cccc4[nH]nnc34)nc12