Reaction Details
TargetCasein kinase II subunit beta
LigandBDBM218912
Substrate/CompetitorBDBM220103
Meas. Tech.Inhibition Assay
pH7±n/a
IC50 613.5±n/a nM
Commentsextracted
Citation Haddach, MTran, JAPierre, FRegan, CFRaffaele, NRavula, SRyckman, DM Pyrazolopyrimidines and related heterocycles as CK2 inhibitors US Patent US9303033 Publication Date 4/5/2016
 
Casein kinase II subunit beta
Name:Casein kinase II subunit beta
Type:Enzyme
Mol. Mass.:24937.13
Organism:Homo sapiens (Human)
Description:P67870
Residue:215
BDBM218912
BDBM220103
NameBDBM218912
Synonyms:US9303033, G7, Table 22A, Compound 1 | US9303033, S3, Table 13A, Compound 1
TypeSmall organic molecule
Emp. Form.C19H16N6O3
Mol. Mass.376.3687
SMILESOc1cccc(c1)-c1cc(NC2CC2)n2ncc(\C=C3/NC(=O)NC3=O)c2n1