Reaction Details
TargetCasein kinase II subunit beta
LigandBDBM218972
Substrate/CompetitorBDBM220103
Meas. Tech.Inhibition Assay
pH7±n/a
IC50 296.8±n/a nM
Commentsextracted
Citation Haddach, MTran, JAPierre, FRegan, CFRaffaele, NRavula, SRyckman, DM Pyrazolopyrimidines and related heterocycles as CK2 inhibitors US Patent US9303033 Publication Date 4/5/2016
 
Casein kinase II subunit beta
Name:Casein kinase II subunit beta
Type:Enzyme
Mol. Mass.:24937.13
Organism:Homo sapiens (Human)
Description:P67870
Residue:215
BDBM218972
BDBM220103
NameBDBM218972
Synonyms:US9303033, Z5, Table 18A, Compound 3
TypeSmall organic molecule
Emp. Form.C23H17ClN6O3S
Mol. Mass.492.937
SMILESClc1cccc(Nc2cc(S(=O)Cc3ccccc3)n3ncc(\C=C4/NC(=O)NC4=O)c3n2)c1