Reaction Details
TargetCasein kinase II subunit beta
LigandBDBM218975
Substrate/CompetitorBDBM220103
Meas. Tech.Inhibition Assay
pH7±n/a
IC50 469±n/a nM
Commentsextracted
Citation Haddach, MTran, JAPierre, FRegan, CFRaffaele, NRavula, SRyckman, DM Pyrazolopyrimidines and related heterocycles as CK2 inhibitors US Patent US9303033 Publication Date 4/5/2016
 
Casein kinase II subunit beta
Name:Casein kinase II subunit beta
Type:Enzyme
Mol. Mass.:24937.13
Organism:Homo sapiens (Human)
Description:P67870
Residue:215
BDBM218975
BDBM220103
NameBDBM218975
Synonyms:US9303033, C6, Table 19A, Compound 2
TypeSmall organic molecule
Emp. Form.C20H20ClN7O3
Mol. Mass.441.871
SMILESCCOCCNc1cc(Nc2cccc(Cl)c2)nc2c(\C=C3/NC(=O)NC3=O)cnn12