Reaction Details
TargetCasein kinase II subunit beta
LigandBDBM218931
Substrate/CompetitorBDBM220103
Meas. Tech.Inhibition Assay
pH7±n/a
IC50 48.7±n/a nM
Commentsextracted
Citation Haddach, MTran, JAPierre, FRegan, CFRaffaele, NRavula, SRyckman, DM Pyrazolopyrimidines and related heterocycles as CK2 inhibitors US Patent US9303033 Publication Date 4/5/2016
 
Casein kinase II subunit beta
Name:Casein kinase II subunit beta
Type:Enzyme
Mol. Mass.:24937.13
Organism:Homo sapiens (Human)
Description:P67870
Residue:215
BDBM218931
BDBM220103
NameBDBM218931
Synonyms:US9303033, G8, Table 22A, Compound 27 | US9303033, L4, Table 13A, Compound 20
TypeSmall organic molecule
Emp. Form.C23H22N8O3
Mol. Mass.458.4726
SMILESO=C1NC(=O)\C(N1)=C\c1cnn2c(NC3CC3)cc(nc12)-c1cccc(OCC2=NCCN2)c1