Reaction Details
TargetCasein kinase II subunit beta
LigandBDBM219161
Substrate/CompetitorBDBM220103
Meas. Tech.Inhibition Assay
pH7±n/a
IC50 654±n/a nM
Commentsextracted
Citation Haddach, MTran, JAPierre, FRegan, CFRaffaele, NRavula, SRyckman, DM Pyrazolopyrimidines and related heterocycles as CK2 inhibitors US Patent US9303033 Publication Date 4/5/2016
 
Casein kinase II subunit beta
Name:Casein kinase II subunit beta
Type:Enzyme
Mol. Mass.:24937.13
Organism:Homo sapiens (Human)
Description:P67870
Residue:215
BDBM219161
BDBM220103
NameBDBM219161
Synonyms:US9303033, H13, Table 24A, Compound 6
TypeSmall organic molecule
Emp. Form.C25H28N8O3S
Mol. Mass.520.607
SMILESCN1CCCC1CCNC(=O)c1cc(cs1)-c1cc(NC2CC2)n2ncc(\C=C3/NC(=O)NC3=O)c2n1