Reaction Details
TargetAldo-keto reductase family 1 member C4
LigandBDBM220122
Substrate/Competitorn/a
Meas. Tech.Discontinuous Radiometric Assay
IC50 28700±n/a nM
Citation Penning, TMAdeniji, AOBurns, MCWinkler, JTwenter, B Bifunctional AKR1C3 inhibitors/androgen receptor modulators and methods of use thereof US Patent US9271961 Publication Date 3/1/2016
 
Aldo-keto reductase family 1 member C4
Name:Aldo-keto reductase family 1 member C4
Type:Enzyme
Mol. Mass.:37068.40
Organism:Homo sapiens (Human)
Description:P17516
Residue:323
BDBM220122
NameBDBM220122
Synonyms:US9271961, BMT 3-224
TypeSmall organic molecule
Emp. Form.C16H13NO5
Mol. Mass.299.2781
SMILESCC(=O)c1ccc(C(O)=O)c(Nc2ccccc2C(O)=O)c1