Reaction Details
TargetAldo-keto reductase family 1 member C3
LigandBDBM220117
Substrate/Competitorn/a
Meas. Tech.Discontinuous Radiometric Assay
Ki 380±n/a nM
Citation Penning, TMAdeniji, AOBurns, MCWinkler, JTwenter, B Bifunctional AKR1C3 inhibitors/androgen receptor modulators and methods of use thereof US Patent US9271961 Publication Date 3/1/2016
 
Aldo-keto reductase family 1 member C3
Name:Aldo-keto reductase family 1 member C3
Type:Enzyme
Mol. Mass.:36859.86
Organism:Homo sapiens (Human)
Description:P42330
Residue:323
BDBM220117
NameBDBM220117
Synonyms:US9271961, 4-Carboxy-2',4'-dinitrodiphenylamine
TypeSmall organic molecule
Emp. Form.C13H9N3O6
Mol. Mass.303.2271
SMILESOC(=O)c1cccc(Nc2ccc(cc2N(=O)=O)N(=O)=O)c1