Reaction Details
TargetProstaglandin G/H synthase 2
LigandBDBM50337281
Substrate/Competitorn/a
Meas. Tech.Discontinuous Radiometric Assay
IC50 740±n/a nM
Citation Penning, TMAdeniji, AOBurns, MCWinkler, JTwenter, B Bifunctional AKR1C3 inhibitors/androgen receptor modulators and methods of use thereof US Patent US9271961 Publication Date 3/1/2016
 
Prostaglandin G/H synthase 2
Name:Prostaglandin G/H synthase 2
Type:Enzyme
Mol. Mass.:69003.89
Organism:Homo sapiens (Human)
Description:Recombinant Cox-2 provided by Cayman (Cayman Chemical Co.,Ann Arbor, MI).
Residue:604
BDBM50337281
NameBDBM50337281
Synonyms:3-[N-(4-nitrophenyl)amino]benzoic acid US9271961, 5
TypeSmall organic molecule
Emp. Form.C13H10N2O4
Mol. Mass.258.2295
SMILESOC(=O)c1cccc(Nc2ccc(cc2)[N+]([O-])=O)c1