Reaction Details
TargetCytochrome P450 11B1, mitochondrial
LigandBDBM8892
Substrate/CompetitorBDBM8582
Meas. Tech.Inhibition Assay
Temperature310.15±n/a K
IC50 1268±n/a nM
Commentsextracted
Citation Hartmann, RVoets, MMüller-Vieira, U Selective inhibitors of human corticosteroid synthases US Patent US9271963 Publication Date 3/1/2016
 
Cytochrome P450 11B1, mitochondrial
Name:Cytochrome P450 11B1, mitochondrial
Type:Enzyme
Mol. Mass.:57591.44
Organism:Homo sapiens (Human)
Description:P15538
Residue:503
BDBM8892
BDBM8582
NameBDBM8892
Synonyms:3-(1-Methyl-3,4-dihydronaphthalen-2-yl)-pyridine Dihydronaphthalene 6 | US9271963, 38
TypeSmall organic molecule
Emp. Form.C16H15N
Mol. Mass.221.297
SMILESCC1=C(CCc2ccccc12)c1cccnc1