Reaction Details
TargetCytochrome P450 11B1, mitochondrial
LigandBDBM8611
Substrate/CompetitorBDBM8582
Meas. Tech.Inhibition Assay
Temperature310.15±n/a K
IC50 9±n/a nM
Commentsextracted
Citation Hartmann, RVoets, MMüller-Vieira, U Selective inhibitors of human corticosteroid synthases US Patent US9271963 Publication Date 3/1/2016
 
Cytochrome P450 11B1, mitochondrial
Name:Cytochrome P450 11B1, mitochondrial
Type:Enzyme
Mol. Mass.:57591.44
Organism:Homo sapiens (Human)
Description:P15538
Residue:503
BDBM8611
BDBM8582
NameBDBM8611
Synonyms:4-{5H,6H,7H,8H-imidazo[1,5-a]pyridin-5-yl}benzonitrile CHEMBL9298 US9271963, Fadrozole
TypeSmall organic molecule
Emp. Form.C14H13N3
Mol. Mass.223.2731
SMILESN#Cc1ccc(cc1)C1CCCc2cncn12