Reaction Details
TargetTyrosine-protein kinase BTK
LigandBDBM191628
Substrate/Competitorn/a
Meas. Tech.In Vitro HotSpot Kinase Assay
IC50 0.89±n/a nM
Citation Honigberg, LVerner, EBuggy, JLoury, DChen, W Inhibitors of bruton's tyrosine kinase for the treatment of solid tumors US Patent US9278100 Publication Date 3/8/2016
 
Tyrosine-protein kinase BTK
Name:Tyrosine-protein kinase BTK
Type:Enzyme
Mol. Mass.:76289.95
Organism:Homo sapiens (Human)
Description:Q06187
Residue:659
BDBM191628
NameBDBM191628
Synonyms:US9181263, 24 | US9278100, 24
TypeSmall organic molecule
Emp. Form.C30H33N7O3
Mol. Mass.539.6281
SMILESNc1ncnc2n(nc(-c3ccc(Oc4ccccc4)cc3)c12)[C@@H]1CCCN(C1)C(=O)\C=C\CN1CCOCC1