Reaction Details
TargetTyrosine-protein kinase Lck
LigandBDBM191606
Substrate/Competitorn/a
Meas. Tech.In Vitro HotSpot Kinase Assay
IC50 208±n/a nM
Citation Honigberg, LVerner, EBuggy, JLoury, DChen, W Inhibitors of bruton's tyrosine kinase for the treatment of solid tumors US Patent US9278100 Publication Date 3/8/2016
 
Tyrosine-protein kinase Lck
Name:Tyrosine-protein kinase Lck
Type:n/a
Mol. Mass.:57987.83
Organism:Homo sapiens (Human)
Description:P06239
Residue:509
BDBM191606
NameBDBM191606
Synonyms:US9181263, 23 | US9278100, 23
TypeSmall organic molecule
Emp. Form.C22H20N6O2
Mol. Mass.400.4332
SMILESNc1ncnc2n(CCNC(=O)C=C)nc(-c3ccc(Oc4ccccc4)cc3)c12