Reaction Details
TargetNeuronal acetylcholine receptor subunit alpha-7
LigandBDBM221048
Substrate/Competitorn/a
Meas. Tech.[125I]Iodo-MLA Binding Assay
pH7.4±n/a
Ki 32.5±1.3 nM
Commentsextracted
Citation Carroll, FIOndachi, PW Nicotinic receptor compounds US Patent US9284322 Publication Date 3/15/2016
 
Neuronal acetylcholine receptor subunit alpha-7
Name:Neuronal acetylcholine receptor subunit alpha-7
Type:Enzyme
Mol. Mass.:56502.44
Organism:Rattus norvegicus (Rat)
Description:Q05941
Residue:502
BDBM221048
NameBDBM221048
Synonyms:US9284322, varenicline | US9303017, Varenicline
TypeSmall organic molecule
Emp. Form.C13H13N3
Mol. Mass.211.2624
SMILESC1[C@H]2CNC[C@@H]1c1cc3nccnc3cc21